[DRBD-user] drbd-0.7.21 on RHEL-3

Eric Pretorious epretorious at vmware.com
Fri Oct 6 05:24:21 CEST 2006


Hello, All:

I'm attempting to `make` drbd-0.7.21 on Red Hat Enterprise Linux 3 but get
this error:

> In file included from /usr/src/linux-2.4.21-27.EL/include/linux/mm.h:22,
>                  from /usr/src/linux-2.4.21-27.EL/include/linux/slab.h:14,
>                  from drbd_actlog.c:28:
> /usr/src/linux-2.4.21-27.EL/include/linux/sched.h:6: invalid suffix on
integer constant
> /usr/src/linux-2.4.21-27.EL/include/linux/sched.h:6: syntax error before
numeric constant
> /usr/src/linux-2.4.21-27.EL/include/linux/sched.h:6: warning: function
declaration isn't a prototype
> make[3]: *** [drbd_actlog.o] Error 1
> make[3]: Leaving directory `/usr/local/src/drbd-0.7.21/drbd'
> make[2]: *** [_mod_/usr/local/src/drbd-0.7.21/drbd] Error 2
> make[2]: Leaving directory `/usr/src/linux-2.4.21-27.EL'
> make[1]: *** [kbuild] Error 2
> make[1]: Leaving directory `/usr/local/src/drbd-0.7.21/drbd'
> make: *** [all] Error 2

What does this mean? How can I fix it?

Eric P.
Palo Alto, CA



More information about the drbd-user mailing list